{"text_format":"1","workbook":"xlsx","n_sheets":2,"sheets":["RME","List"],"not_rendered":{"charts":0,"images":3,"macros":1,"external_links":0,"defined_names":1,"comments":0,"pivot_tables":0},"unopened":[],"bounds":{"document_bytes":16777216,"sheet_cells":100000,"rows_first":2000,"rows_last":500,"rows_between":2000,"halvings":0,"cell_chars":16384,"cell_head_chars":4096},"cells_cut":0,"cells_raw":0,"read":"whole","date_system":"1900"}

{"sheet":"RME","index":0,"n_rows":54,"n_cols":11,"rows_kept":54,"cut":false,"hidden":false,"merged":[[29,1,29,6],[28,1,28,6],[30,1,30,5],[37,1,37,6],[50,1,50,8],[42,1,42,8],[56,0,56,11],[34,1,34,10],[52,5,52,7],[52,9,52,10],[36,1,36,5],[41,1,41,8],[50,9,50,10],[41,9,41,10],[42,9,42,10],[43,9,43,10],[44,9,44,10],[45,9,45,10],[49,9,49,10],[52,2,52,3],[53,2,53,3],[39,1,39,10],[16,4,16,5],[17,4,17,5],[23,1,23,6],[19,1,19,3],[14,1,14,3],[15,1,15,3],[16,1,16,3],[49,1,49,8],[21,1,21,10],[17,1,17,3],[18,4,18,5],[19,4,19,5],[24,1,24,6],[43,1,43,8],[45,1,45,8],[44,1,44,8],[25,1,25,6],[33,1,33,6],[38,1,38,6],[31,1,31,5],[32,1,32,5],[26,1,26,5],[27,1,27,6],[10,1,10,3],[11,1,11,3],[13,1,13,3],[3,4,3,9],[4,4,4,9],[5,4,5,9],[6,4,6,9],[3,1,3,3],[4,1,4,3],[5,1,5,3],[6,1,6,3],[12,1,12,3],[8,2,8,4]]}
[]
[null,"ОПРОСНЫЙ ЛИСТ ДЛЯ ЗАКАЗА КРУЭ RME"]
[]
[null,"Дата"]
[null,"Заказчик"]
[null,"Адрес"]
[null,"Наименование проекта",null,null,"Обязательно!"]
[]
[null,null," -  поля, обязательные для заполнения (выбор из списка)"]
[]
[null,"Количество"]
[null,"Возможность расширения (шаг 1)"]
[null,"Тип ячейки (шаг 2)"]
[null,"Ток термической стойкости",null,null,null,"кА"]
[null,"Номинальный ток ",null,null,null,"А"]
[null,"Номинальное напряжение",null,null,null,"кВ"]
[null,"Цоколь"]
[null,"Устройство релейной защиты* (только на ф. D,B)"]
[null,"Трансформаторы тока для релейной защиты"]
[null,"Контроль давления элегаза",null,null,"Нет"]
[]
[null,"(*) БМРЗ-60-VIP-1520M0-01 - базовая версия без модуля связи\n    БМРЗ-60-VIP-2521M0-01 – расширенная версия с модулем связи"]
[null,"Характеристики функций"]
[null,"Номера функции (заводская нумерация - справа налево)",null,null,null,null,null,4,3,2,1]
[null,"Наименование функций",null,null,null,null,null,{"$f":"IFERROR(OFFSET(List!$F$101,MATCH($E$13,List!$F$101:$F$114,0)-1,1,COUNTIF(List!$F$101:$F$114,$E$13),1),\" \")","v":" "},{"$f":"IFERROR(OFFSET(List!$F$101,MATCH($E$13,List!$F$101:$F$114,0)-1,2,COUNTIF(List!$F$101:$F$114,$E$13),1),\" \")","v":" "},{"$f":"IFERROR(OFFSET(List!$F$101,MATCH($E$13,List!$F$101:$F$114,0)-1,3,COUNTIF(List!$F$101:$F$114,$E$13),1),\" \")","v":" "},{"$f":"IFERROR(OFFSET(List!$F$101,MATCH($E$13,List!$F$101:$F$114,0)-1,4,COUNTIF(List!$F$101:$F$114,E13),1),\" \")","v":" "}]
[null,"Тип подключаемого кабеля"]
[null,"Моторизованный привод ",null,null,null,null,"220 В AC (50 Гц)"]
[null,"Контакты положения (2НО+2НЗ) "]
[null,"Контакт сигнализации аварийного отключения (только на ф. D,B)"]
[null,"Контакт запрета вкл-я после авар.откл-я (только на ф-ции с мотор-редуктором)"]
[null,"Независимый расцепитель (только на ф. D,B)",null,null,null,null,"220 В AC (50 Гц)"]
[null,"Указатель тока короткого замыкания (только на ф.I)",null,null,null,null,"Без УТКЗ"]
[null,"Индикатор наличия напряжения",null,null,null,null,"Systeme VPIS"]
[null,"Резистор обогрева"]
[]
[null,"Дополнительные опции для ТМ:"]
[null,"Комплект модуля телемеханики:",null,null,null,null,"Без модуля ТМ"]
[null,"Подготовка под установку комплекта модуля телемеханики**"]
[null,"Доп.контакты положения"]
[null,"(**)В подготовку входит: крепление для установки модуля ТМ, разводка для его подключения, комплект измерит.клемм, вывод проводов в ячейку."]
[null,"Аксессуары:"]
[null,"Наименование",null,null,null,null,null,null,null,"Количество"]
[null,"Прибор для фазировки кабелей"]
[null,"Комплект стержней для испытания кабелей  (всегда в комплекте)",null,null,null,null,null,null,null,1]
[null,"Ручка управления (всегда в комплекте)",null,null,null,null,null,null,null,1]
[null,"Комплект расширения (обязательно указывать при соединении двух расширяемых ячеек)"]
[]
[]
[]
[]
[]
[]
[null,"Заполнил:",null,null,"Должность:",null,null,null,"Телефон:"]
[null,null,"ФИО"]

{"sheet":"List","index":1,"n_rows":130,"n_cols":16,"rows_kept":130,"cut":false,"hidden":true,"merged":[]}
["УТКЗ"]
["А-СИГНАЛ М (К1)"]
["А-СИГНАЛ ДМ (КЛ)"]
["Элько Н-М"]
["Без УТКЗ"]
[]
[]
[]
[]
["Индикатор наличия напряжения"]
["Systeme VPIS"]
["Systeme VPIS-VO"]
[]
[]
["Номинальное напряжение"]
[6]
[10]
[20]
[]
["Ток терм.стойкости"]
[16]
[20]
[]
["Ном.ток"]
[200]
[630]
[]
[]
["Наибольшее рабочее напряжение"]
[24]
[]
["Функции"]
[]
["I"]
["D"]
["B"]
[]
["Расширение"]
["NE"]
["RE"]
["DE"]
[]
[]
[]
["Блокировки"]
["R1 ВН","I","доступно ШЭЗЭМ"]
["R1 ЗР","I"]
["R2","I","доступно ШЭЗЭМ"]
["R6","D,B","доступно ШЭЗЭМ"]
["R7","D,B"]
["R8","D,B"]
[]
["Моторизация"]
["220 В AC (50 Гц)"]
["24 В DC"]
["48 В DC"]
[]
["Без цоколя"]
["Цоколь 260 мм"]
["Цоколь 520 мм"]
[]
["Нет"]
["БМРЗ-60-VIP-1520М0-01"]
["БМРЗ-60-VIP-2521М0-01"]
["БЭМП РУ-АП"]
[]
[]
[]
[]
[]
["+","+"]
[]
["1-фаз"]
["3-фаз"]
[]
["Нет"]
["Манометр"]
["Датчик давления"]
[]
[]
["Трансформаторы тока"]
["ТП-ЭК-0,66 M7 ВИП 200/5"]
["ТП-ЭК-0,66 M7 ВИП 600/5"]
[]
[]
["Телемеханика"]
["Без модуля ТМ"]
["TOPAZ HVD3 RTU5 "]
["ЭНИП-2-…-32 "]
[]
[]
["Тип ячейки"]
[]
["IIDI","I","I","D","I"]
[]
[]
[]
[]
[]
["NE","RE","DE",null,"Тип ","функция",null,null,null,null,null,"функция"]
["I",null,"I",null,"NE","I",null,null,null,"I",null,"I","Нет",null,null,200]
["D",null,"D",null,"NE","D",null,null,null,"D",null,"D","БМРЗ-60-VIP-1520М0-01","ТП-ЭК-0,66 M7 ВИП 200/5"]
["B",null,"B",null,"NE","B",null,null,null,"B",null,"D","БМРЗ-60-VIP-2521М0-01","ТП-ЭК-0,66 M7 ВИП 600/5"]
["II",null,null,null,"NE","II",null,null,"I","I",null,"B","БМРЗ-60-VIP-1520М0-01","ТП-ЭК-0,66 M7 ВИП 200/5"]
["DI",null,null,null,"NE","DI",null,null,"D","I",null,"B","БМРЗ-60-VIP-2521М0-01","ТП-ЭК-0,66 M7 ВИП 600/5"]
["BI",null,null,null,"NE","BI",null,null,"B","I",null,"II","Нет","Нет"]
["III","III","III",null,"NE","III",null,"I","I","I",null,"DI","БМРЗ-60-VIP-1520М0-01","ТП-ЭК-0,66 M7 ВИП 200/5"]
["IDI","IDI","IDI",null,"NE","IDI",null,"I","D","I",null,"DI","БМРЗ-60-VIP-2521М0-01","ТП-ЭК-0,66 M7 ВИП 600/5"]
["IBI","IBI","IBI",null,"NE","IBI",null,"I","B","I",null,"BI","БМРЗ-60-VIP-1520М0-01","ТП-ЭК-0,66 M7 ВИП 200/5"]
["IIII","IIII","IIII",null,"NE","IIII","I","I","I","I",null,"BI","БМРЗ-60-VIP-2521М0-01","ТП-ЭК-0,66 M7 ВИП 600/5"]
["IIDI","IIDI","IIDI",null,"NE","IIDI","I","I","D","I",null,"III","Нет","Нет"]
["IIBI","IIBI",null,null,"NE","IIBI","I","I","B","I",null,"IDI","БМРЗ-60-VIP-1520М0-01","ТП-ЭК-0,66 M7 ВИП 200/5"]
["DIDI","DIDI",null,null,"NE","DIDI","D","I","D","I",null,"IDI","БМРЗ-60-VIP-2521М0-01","ТП-ЭК-0,66 M7 ВИП 600/5"]
["BIBI","BIBI",null,null,"NE","BIBI","B","I","B","I",null,"IBI","БМРЗ-60-VIP-1520М0-01","ТП-ЭК-0,66 M7 ВИП 200/5"]
[null,null,null,null,"RE","III",null,null,null,null,null,"IBI","БМРЗ-60-VIP-2521М0-01","ТП-ЭК-0,66 M7 ВИП 600/5"]
[null,null,null,null,"RE","IDI",null,null,null,null,null,"IIII","Нет","Нет"]
[null,null,null,null,"RE","IBI",null,null,null,null,null,"IIDI","БМРЗ-60-VIP-1520М0-01","ТП-ЭК-0,66 M7 ВИП 200/5"]
[null,null,null,null,"RE","IIII",null,null,null,null,null,"IIDI","БМРЗ-60-VIP-2521М0-01","ТП-ЭК-0,66 M7 ВИП 600/5"]
[null,null,null,null,"RE","IIDI",null,null,null,null,null,"IIBI","БМРЗ-60-VIP-1520М0-01","ТП-ЭК-0,66 M7 ВИП 200/5"]
[null,null,null,null,"RE","IIBI",null,null,null,null,null,"IIBI","БМРЗ-60-VIP-2521М0-01","ТП-ЭК-0,66 M7 ВИП 600/5"]
[null,null,null,null,"RE","DIDI",null,null,null,null,null,"DIDI","БМРЗ-60-VIP-1520М0-01","ТП-ЭК-0,66 M7 ВИП 200/5"]
[null,null,null,null,"RE","BIBI",null,null,null,null,null,"DIDI","БМРЗ-60-VIP-2521М0-01","ТП-ЭК-0,66 M7 ВИП 600/5"]
[null,null,null,null,"DE","I",null,null,null,null,null,"BIBI","БМРЗ-60-VIP-1520М0-01","ТП-ЭК-0,66 M7 ВИП 200/5"]
[null,null,null,null,"DE","D",null,null,null,null,null,"BIBI","БМРЗ-60-VIP-2521М0-01","ТП-ЭК-0,66 M7 ВИП 600/5"]
[null,null,null,null,"DE","B"]
[null,null,null,null,"DE","III"]
[null,null,null,null,"DE","IDI"]
[null,null,null,null,"DE","IBI"]
[null,null,null,null,"DE","IIII"]
[null,null,null,null,"DE","IIDI"]